Target
Epidermal growth factor receptor
Ligand
BDBM50148692
Substrate
Meas. Tech.
ChEMBL_66577 (CHEMBL683037)
IC50
>10000±n/a nM
Citation
 Revesz, LBlum, EDi Padova, FEBuhl, TFeifel, RGram, HHiestand, PManning, URucklin, G Novel p38 inhibitors with potent oral efficacy in several models of rheumatoid arthritis. Bioorg Med Chem Lett 14:3595-9 (2004)  
Target
Name:
Epidermal growth factor receptor
Synonyms:
EGF Receptor Substrate EGFR_HUMAN ERBB1 Epidermal Growth Factor Receptor erbB-1 Epidermal growth factor receptor (EGFR) HER1 Proto-oncogene c-ErbB-1 Tyrosine-Protein Kinase ErbB-1
Type:
Receptor Kinase Domain
Mol. Mass.:
134279.59
Organism:
Homo sapiens (Human)
Description:
P00533
Residue:
1210
  
Inhibitor
Name:
BDBM50148692
Synonyms:
CHEMBL120185 | Cyclopentyl-{4-[2-(4-fluoro-phenyl)-5-(4-methyl-piperazin-1-yl)-imidazo[4,5-b]pyridin-1-yl]-pyrimidin-2-yl}-amine
Type:
Small organic molecule
Emp. Form.:
C26H29FN8
Mol. Mass.:
472.5605
SMILES:
CN1CCN(CC1)c1ccc2n(c(nc2n1)-c1ccc(F)cc1)-c1ccnc(NC2CCCC2)n1
: