Target
Platelet glycoprotein 4
Ligand
BDBM50581254
Substrate
Meas. Tech.
ChEMBL_2150268 (CHEMBL5034730)
IC50
890±n/a nM
Citation
 Ohm, RGMulumba, MChingle, RMAhsanullah, naZhang, JChemtob, SOng, HLubell, WD Diversity-Oriented A J Med Chem 64:9365-9380 (2021)  
Target
Name:
Platelet glycoprotein 4
Synonyms:
Adipocyte membrane protein CD_antigen=CD36 Fat Fatty acid transport protein GPIV PAS IV Platelet glycoprotein IV
Type:
PROTEIN
Mol. Mass.:
52740.95
Organism:
Rattus norvegicus
Description:
ChEMBL_858884
Residue:
472
  
Inhibitor
Name:
BDBM50581254
Synonyms:
CHEMBL4471086
Type:
Small organic molecule
Emp. Form.:
C50H59N11O7
Mol. Mass.:
926.073
SMILES:
C[C@@H]1NC(=O)[C@@H](Cc2c[nH]c3ccccc23)NC(=O)N(CC#CCN(CC=C)CCCC[C@H](NC(=O)[C@@H](Cc2ccccc2)NC(=O)[C@H](Cc2c[nH]c3ccccc23)NC1=O)C(N)=O)NC(C)=O
: