Target
Platelet glycoprotein 4
Ligand
BDBM50581259
Substrate
Meas. Tech.
ChEMBL_2150268 (CHEMBL5034730)
IC50
1860±n/a nM
Citation
 Ohm, RGMulumba, MChingle, RMAhsanullah, naZhang, JChemtob, SOng, HLubell, WD Diversity-Oriented A J Med Chem 64:9365-9380 (2021)  
Target
Name:
Platelet glycoprotein 4
Synonyms:
Adipocyte membrane protein CD_antigen=CD36 Fat Fatty acid transport protein GPIV PAS IV Platelet glycoprotein IV
Type:
PROTEIN
Mol. Mass.:
52740.95
Organism:
Rattus norvegicus
Description:
ChEMBL_858884
Residue:
472
  
Inhibitor
Name:
BDBM50581259
Synonyms:
CHEMBL5080816
Type:
Small organic molecule
Emp. Form.:
C51H64N12O7
Mol. Mass.:
957.1301
SMILES:
CCCN1CCCC[C@H](NC(=O)[C@@H](Cc2ccccc2)NC(=O)[C@H](Cc2c[nH]c3ccccc23)NC(=O)[C@H](C)NC(=O)[C@@H](Cc2c[nH]c3ccccc23)NC(=O)N(CC#CC1)NC(=O)[C@H](C)N)C(N)=O
: