Target
Platelet glycoprotein 4
Ligand
BDBM50581260
Substrate
Meas. Tech.
ChEMBL_2150268 (CHEMBL5034730)
IC50
670±n/a nM
Citation
 Ohm, RGMulumba, MChingle, RMAhsanullah, naZhang, JChemtob, SOng, HLubell, WD Diversity-Oriented A J Med Chem 64:9365-9380 (2021)  
Target
Name:
Platelet glycoprotein 4
Synonyms:
Adipocyte membrane protein CD_antigen=CD36 Fat Fatty acid transport protein GPIV PAS IV Platelet glycoprotein IV
Type:
PROTEIN
Mol. Mass.:
52740.95
Organism:
Rattus norvegicus
Description:
ChEMBL_858884
Residue:
472
  
Inhibitor
Name:
BDBM50581260
Synonyms:
CHEMBL4528721
Type:
Small organic molecule
Emp. Form.:
C53H64N12O8
Mol. Mass.:
997.1509
SMILES:
C[C@H](NC(C)=O)C(=O)NN1CC#CCN(CC=C)CCCC[C@H](NC(=O)[C@@H](Cc2ccccc2)NC(=O)[C@H](Cc2c[nH]c3ccccc23)NC(=O)[C@H](C)NC(=O)[C@@H](Cc2c[nH]c3ccccc23)NC1=O)C(N)=O
: