Target
Protein farnesyltransferase subunit beta/geranylgeranyltransferase type-1 subunit alpha
Ligand
BDBM50153782
Substrate
Meas. Tech.
ChEMBL_305040 (CHEMBL831678)
IC50
0.6±n/a nM
Citation
 Li, QWang, GTLi, TGwaltney, SLWoods, KWClaiborne, AWang, XGu, WCohen, JStoll, VSHutchins, CFrost, DRosenberg, SHSham, HL Synthesis and activity of 1-aryl-1'-imidazolyl methyl ethers as non-thiol farnesyltransferase inhibitors. Bioorg Med Chem Lett 14:5371-6 (2004)  
Target
Name:
Protein farnesyltransferase subunit beta/geranylgeranyltransferase type-1 subunit alpha
Synonyms:
Protein Farnesyltransferase (PFT) | Protein farnesyltransferase
Type:
Protein Complex
Mol. Mass.:
Description:
Purified bovine brain FTase.
Components:
This complex has 2 components.
Component 1
Name:
Protein farnesyltransferase/geranylgeranyltransferase type-1 subunit alpha
Synonyms:
CAAX farnesyltransferase alpha subunit FNTA_BOVIN GGTase-I-alpha Protein Farnesyltransferase (PFT) Chain A Protein farnesyltransferase/geranylgeranyltransferase type I alpha subunit Type I protein geranyl-geranyltransferase alpha subunit
Type:
Enzyme
Mol. Mass.:
43827.38
Organism:
Bos taurus (bovine)
Description:
The enzyme was purified from a bovine brain homogenate by sequential ammonium sulfate fractionation and affinity chromatography.
Residue:
375
  
Component 2
Name:
Protein farnesyltransferase subunit beta
Synonyms:
CAAX farnesyltransferase subunit beta FNTB_BOVIN Protein farnesyltransferase Protein farnesyltransferase subunit beta Ras proteins prenyltransferase subunit beta
Type:
Enzyme Subunit
Mol. Mass.:
48758.49
Organism:
Bos taurus (bovine)
Description:
Protein farnesyltransferase subunit beta
Residue:
437
  
Inhibitor
Name:
BDBM50153782
Synonyms:
6-(((1-(4-cyanobenzyl)-1H-imidazol-5-yl)methoxy)methyl)-3',4'-dimethylbiphenyl-3-carbonitrile CHEMBL182171
Type:
Small organic molecule
Emp. Form.:
C28H24N4O
Mol. Mass.:
432.5164
SMILES:
Cc1ccc(cc1C)-c1cc(ccc1COCc1cncn1Cc1ccc(cc1)C#N)C#N
: