Target
5-hydroxytryptamine receptor 6
Ligand
BDBM50155130
Substrate
Meas. Tech.
ChEMBL_303107 (CHEMBL829617)
Ki
3.7±n/a nM
Citation
 Bernotas, RLenicek, SAntane, SZhang, GMSmith, DCoupet, JHarrison, BSchechter, LE 1-(2-Aminoethyl)-3-(arylsulfonyl)-1H-indoles as novel 5-HT6 receptor ligands. Bioorg Med Chem Lett 14:5499-502 (2004)  
Target
Name:
5-hydroxytryptamine receptor 6
Synonyms:
5-HT-6 5-hydroxytryptamine receptor 6 (5-HT-6) 5-hydroxytryptamine receptor 6 (5HT6) HTR6 Serotonin 6 (5-HT6) receptor | Serotonin Receptor 6
Type:
G Protein-Coupled Receptor (GPCR)
Mol. Mass.:
46968.43
Organism:
Homo sapiens (Human)
Description:
P50406
Residue:
440
  
Inhibitor
Name:
BDBM50155130
Synonyms:
CHEMBL185958 | Dimethyl-{2-[3-(naphthalene-1-sulfonyl)-indol-1-yl]-ethyl}-amine
Type:
Small organic molecule
Emp. Form.:
C22H22N2O2S
Mol. Mass.:
378.487
SMILES:
CN(C)CCn1cc(c2ccccc12)S(=O)(=O)c1cccc2ccccc12
: