Target
Metabotropic glutamate receptor 2
Ligand
BDBM50153757
Substrate
Meas. Tech.
ChEMBL_304250 (CHEMBL829721)
EC50
348±n/a nM
Citation
 Pinkerton, ABCube, RVHutchinson, JHJames, JKGardner, MFSchaffhauser, HRowe, BADaggett, LPVernier, JM Allosteric potentiators of the metabotropic glutamate receptor 2 (mGlu2). Part 2: 4-thiopyridyl acetophenones as non-tetrazole containing mGlu2 receptor potentiators. Bioorg Med Chem Lett 14:5867-72 (2004)  
Target
Name:
Metabotropic glutamate receptor 2
Synonyms:
GPRC1B GRM2_HUMAN Metabotropic glutamate receptor mGlu2 | metabotropic glutamate 2
Type:
Enzyme
Mol. Mass.:
95584.88
Organism:
Homo sapiens (Human)
Description:
Q14416
Residue:
872
  
Inhibitor
Name:
BDBM50153757
Synonyms:
1-(2-Hydroxy-3-propyl-4-{4-[4-(1H-tetrazol-5-yl)-phenoxy]-butoxy}-phenyl)-ethanone CHEMBL182371
Type:
Small organic molecule
Emp. Form.:
C22H26N4O4
Mol. Mass.:
410.4662
SMILES:
CCCc1c(OCCCCOc2ccc(cc2)-c2nnn[nH]2)ccc(C(C)=O)c1O
: