Target
Fibroblast growth factor receptor 1
Ligand
BDBM25118
Substrate
Meas. Tech.
ChEMBL_2184222 (CHEMBL5096304)
IC50
8.0±n/a nM
Citation
 Yamani, AZd?alik-Bielecka, DLipner, JSta?czak, APiórkowska, NSta?czak, PSOlejkowska, PHucz-Kalitowska, JMagdycz, MDzwonek, KDubiel, KLamparska-Przybysz, MPopiel, DPieczykolan, JWieczorek, M Discovery and optimization of novel pyrazole-benzimidazole CPL304110, as a potent and selective inhibitor of fibroblast growth factor receptors FGFR (1-3). Eur J Med Chem 210:0 (2021) Target
Name:
Fibroblast growth factor receptor 1
Synonyms:
BFGFR Basic fibroblast growth factor receptor 1 (FGFR1) CEK FGFR-1 FGFR-1, (FL) FGFR1_HUMAN FLT2 Fibroblast growth factor receptor 1 (FGFR-1) Fms-like tyrosine kinase 2 N-sam bFGF-R | c-fgr
Type:
Receptor
Mol. Mass.:
91861.70
Organism:
Homo sapiens (Human)
Description:
P11362
Residue:
822
  
Inhibitor
Name:
BDBM25118
Synonyms:
(3Z)-4-amino-5-fluoro-3-[5-(4-methylpiperazino)-1,3-dihydrobenzimidazol-2-ylidene]carbostyril CHEMBL522892 | CHIR-258
Type:
Small organic molecule
Emp. Form.:
C21H21FN6O
Mol. Mass.:
392.4294
SMILES:
CN1CCN(CC1)c1ccc2nc([nH]c2c1)-c1c(N)c2c(F)cccc2[nH]c1=O
: