Target
Fibroblast growth factor receptor 1
Ligand
BDBM50026612
Substrate
Meas. Tech.
ChEMBL_2184225 (CHEMBL5096307)
IC50
69±n/a nM
Citation
 Yamani, AZd?alik-Bielecka, DLipner, JSta?czak, APiórkowska, NSta?czak, PSOlejkowska, PHucz-Kalitowska, JMagdycz, MDzwonek, KDubiel, KLamparska-Przybysz, MPopiel, DPieczykolan, JWieczorek, M Discovery and optimization of novel pyrazole-benzimidazole CPL304110, as a potent and selective inhibitor of fibroblast growth factor receptors FGFR (1-3). Eur J Med Chem 210:0 (2021) Target
Name:
Fibroblast growth factor receptor 1
Synonyms:
BFGFR Basic fibroblast growth factor receptor 1 (FGFR1) CEK FGFR-1 FGFR-1, (FL) FGFR1_HUMAN FLT2 Fibroblast growth factor receptor 1 (FGFR-1) Fms-like tyrosine kinase 2 N-sam bFGF-R | c-fgr
Type:
Receptor
Mol. Mass.:
91861.70
Organism:
Homo sapiens (Human)
Description:
P11362
Residue:
822
  
Inhibitor
Name:
BDBM50026612
Synonyms:
BIBF-1120 US10981896, Compound Nintedanib US11208381, Nintedanib | Vargatef
Type:
Small organic molecule
Emp. Form.:
C31H33N5O4
Mol. Mass.:
539.6248
SMILES:
COC(=O)c1ccc2\C(=C(\Nc3ccc(cc3)N(C)C(=O)CN3CCN(C)CC3)c3ccccc3)C(=O)Nc2c1
: