Target
eIF-2-alpha kinase GCN2
Ligand
BDBM50591043
Substrate
Meas. Tech.
ChEMBL_2199067 (CHEMBL5111583)
IC50
23±n/a nM
Citation
 Jackson, JJShibuya, GMRavishankar, BAdusumilli, LBradford, DBrockstedt, DGBucher, CBui, MCho, CColas, CCutler, GDukes, AHan, XHu, DXJacobson, SKassner, PDKatibah, GEKo, MYMKolhatkar, ULeger, PRMa, AMarshall, LMaung, JNg, AAOkano, APookot, DPoon, DRamana, CReilly, MKRobles, OSchwarz, JBShakhmin, AAShunatona, HPSreenivasan, RTivitmahaisoon, PXu, MZaw, TWustrow, DJZibinsky, M Potent GCN2 Inhibitor Capable of Reversing MDSC-Driven T Cell Suppression Demonstrates In Vivo Efficacy as a Single Agent and in Combination with Anti-Angiogenesis Therapy. J Med Chem 65:12895-12924 (2022) Target
Name:
eIF-2-alpha kinase GCN2
Synonyms:
E2AK4_HUMAN Eukaryotic translation initiation factor 2-alpha kinase 4 GCN2(Kin.Dom.2 S808G) KIAA1338
Type:
PROTEIN
Mol. Mass.:
186899.26
Organism:
Homo sapiens (Human)
Description:
ChEMBL_1495738
Residue:
1649
  
Inhibitor
Name:
BDBM50591043
Synonyms:
CHEMBL5199283
Type:
Small organic molecule
Emp. Form.:
C20H18N8
Mol. Mass.:
370.4105
SMILES:
CCn1cc(Nc2ncc3c(C)nn(-c4ccc5ncccc5c4)c3n2)cn1
: