Target
eIF-2-alpha kinase GCN2
Ligand
BDBM50591075
Substrate
Meas. Tech.
ChEMBL_2199068 (CHEMBL5111584)
IC50
9.0±n/a nM
Citation
 Jackson, JJShibuya, GMRavishankar, BAdusumilli, LBradford, DBrockstedt, DGBucher, CBui, MCho, CColas, CCutler, GDukes, AHan, XHu, DXJacobson, SKassner, PDKatibah, GEKo, MYMKolhatkar, ULeger, PRMa, AMarshall, LMaung, JNg, AAOkano, APookot, DPoon, DRamana, CReilly, MKRobles, OSchwarz, JBShakhmin, AAShunatona, HPSreenivasan, RTivitmahaisoon, PXu, MZaw, TWustrow, DJZibinsky, M Potent GCN2 Inhibitor Capable of Reversing MDSC-Driven T Cell Suppression Demonstrates In Vivo Efficacy as a Single Agent and in Combination with Anti-Angiogenesis Therapy. J Med Chem 65:12895-12924 (2022) Target
Name:
eIF-2-alpha kinase GCN2
Synonyms:
E2AK4_HUMAN Eukaryotic translation initiation factor 2-alpha kinase 4 GCN2(Kin.Dom.2 S808G) KIAA1338
Type:
PROTEIN
Mol. Mass.:
186899.26
Organism:
Homo sapiens (Human)
Description:
ChEMBL_1495738
Residue:
1649
  
Inhibitor
Name:
BDBM50591075
Synonyms:
CHEMBL5200118
Type:
Small organic molecule
Emp. Form.:
C25H29BrN8O3S2
Mol. Mass.:
633.584
SMILES:
CNC(=O)[C@]1(C)CC[C@H](C1)Nc1ncc2c(Br)nn(-c3ccc(-c4nnc(C)s4)c(CCS(C)(=O)=O)c3)c2n1
: