Target
LIM domain kinase 1/2
Ligand
BDBM13216
Substrate
Meas. Tech.
ChEMBL_2199838 (CHEMBL5112354)
IC50
74±n/a nM
Citation
 Collins, RLee, HJones, DHElkins, JMGillespie, JAThomas, CBaldwin, AGJones, KWaters, LPaine, MAtack, JRWard, SEGrubisha, OFoley, DW Comparative Analysis of Small-Molecule LIMK1/2 Inhibitors: Chemical Synthesis, Biochemistry, and Cellular Activity. J Med Chem 65:13705-13713 (2022) Target
Name:
LIM domain kinase 1/2
Synonyms:
Type:
Mol. Mass.:
Description:
ASSAY_ID of ChEMBL is 2199838
Components:
This complex has 2 components.
Component 1
Name:
LIM domain kinase 2
Synonyms:
LIMK2 | LIMK2_HUMAN
Type:
PROTEIN
Mol. Mass.:
72238.81
Organism:
Homo sapiens (Human)
Description:
ChEMBL_1514398
Residue:
638
  
Component 2
Name:
LIM domain kinase 1
Synonyms:
LIMK LIMK1 | LIMK1_HUMAN
Type:
Enzyme Catalytic Domain
Mol. Mass.:
72591.81
Organism:
Homo sapiens (Human)
Description:
gi_4505001
Residue:
647
  
Inhibitor
Name:
BDBM13216
Synonyms:
BMS-354825 DASATINIB N-(2-chloro-6-methylphenyl)-2-({6-[4-(2-hydroxyethyl)piperazin-1-yl]-2-methylpyrimidin-4-yl}amino)-1,3-thiazole-5-carboxamide US20230348453, Compound A8 med.21724, Compound Dasatinib
Type:
Small organic molecule
Emp. Form.:
C22H26ClN7O2S
Mol. Mass.:
488.006
SMILES:
Cc1nc(Nc2ncc(s2)C(=O)Nc2c(C)cccc2Cl)cc(n1)N1CCN(CCO)CC1
: