Target
Serine/threonine-protein kinase PLK4
Ligand
BDBM50591934
Substrate
Meas. Tech.
ChEMBL_2202750 (CHEMBL5115458)
IC50
0.100000±n/a nM
Citation
 Sun, YSun, YWang, LWu, TYin, WWang, JXue, YQin, QSun, YYang, HZhao, DCheng, M Design, synthesis, and biological evaluation of novel pyrazolo [3,4-d]pyrimidine derivatives as potent PLK4 inhibitors for the treatment of TRIM37-amplified breast cancer. Eur J Med Chem 238:0 (2022) Target
Name:
Serine/threonine-protein kinase PLK4
Synonyms:
PLK4 Polo-Like Kinase 4 STK18 | Serine/threonine-protein kinase PLK4
Type:
PROTEIN
Mol. Mass.:
108996.91
Organism:
Homo sapiens (Human)
Description:
ChEMBL_1474078
Residue:
970
  
Inhibitor
Name:
BDBM50591934
Synonyms:
CHEMBL5209160
Type:
Small organic molecule
Emp. Form.:
C16H14F2N8
Mol. Mass.:
356.3328
SMILES:
Cc1cc(Nc2nc(NCc3ccc(F)cc3F)nc3[nH]ncc23)n[nH]1
: