Target
cGMP-specific 3',5'-cyclic phosphodiesterase
Ligand
BDBM50165820
Substrate
Meas. Tech.
ChEMBL_304843 (CHEMBL827930)
IC50
13000±n/a nM
Citation
 Feixas, JGiovannoni, MPVergelli, CGavaldà, ACesari, NGraziano, ADal Piaz, V New pyrazolo[1',5':1,6]pyrimido[4,5-d]pyridazin-4(3H)-ones as potent and selective PDE5 inhibitors. Bioorg Med Chem Lett 15:2381-4 (2005)  
Target
Name:
cGMP-specific 3',5'-cyclic phosphodiesterase
Synonyms:
3',5'-cyclic phosphodiesterase PDE5 PDE5A_HUMAN Phosphodiesterase 5 (PDE5) Phosphodiesterase 5A (PDE5A) cGMP-specific 3',5'-cyclic phosphodiesterase
Type:
Protein
Mol. Mass.:
99975.83
Organism:
Homo sapiens (Human)
Description:
O76074
Residue:
875
  
Inhibitor
Name:
BDBM50165820
Synonyms:
2-Benzo[1,3]dioxol-5-yl-7-benzyl-4,9-dimethyl-7H-3,3a,5,7,8-pentaaza-cyclopenta[a]naphthalen-6-one | CHEMBL364091
Type:
Small organic molecule
Emp. Form.:
C24H19N5O3
Mol. Mass.:
425.4394
SMILES:
Cc1nn(Cc2ccccc2)c(=O)c2nc(C)n3nc(cc3c12)-c1ccc2OCOc2c1
: