Target
5-hydroxytryptamine receptor 7
Ligand
BDBM50171235
Substrate
Meas. Tech.
ChEMBL_321335 (CHEMBL880619)
IC50
3000±n/a nM
Citation
 Mattsson, CSonesson, CSandahl, AGreiner, HEGassen, MPlaschke, JLeibrock, JBöttcher, H 2-Alkyl-3-(1,2,3,6-tetrahydropyridin-4-yl)-1H-indoles as novel 5-HT6 receptor agonists. Bioorg Med Chem Lett 15:4230-4 (2005)  
Target
Name:
5-hydroxytryptamine receptor 7
Synonyms:
5-HT-7 5-HT7 5-HT7S 5HT7 HTR7 | Serotonin receptor 7
Type:
G Protein-Coupled Receptor (GPCR)
Mol. Mass.:
53573.08
Organism:
Homo sapiens (Human)
Description:
P34969
Residue:
479
  
Inhibitor
Name:
BDBM50171235
Synonyms:
5-Chloro-2-methyl-3-(1,2,3,6-tetrahydro-pyridin-4-yl)-1H-indole | CHEMBL364005
Type:
Small organic molecule
Emp. Form.:
C14H15ClN2
Mol. Mass.:
246.735
SMILES:
Cc1[nH]c2ccc(Cl)cc2c1C1=CCNCC1
: