Target
5-hydroxytryptamine receptor 1B
Ligand
BDBM50171235
Substrate
Meas. Tech.
ChEMBL_321331 (CHEMBL880615)
IC50
110±n/a nM
Citation
 Mattsson, CSonesson, CSandahl, AGreiner, HEGassen, MPlaschke, JLeibrock, JBöttcher, H 2-Alkyl-3-(1,2,3,6-tetrahydropyridin-4-yl)-1H-indoles as novel 5-HT6 receptor agonists. Bioorg Med Chem Lett 15:4230-4 (2005)  
Target
Name:
5-hydroxytryptamine receptor 1B
Synonyms:
5-HT-1B 5-HT1B 5HT1B_HUMAN HTR1DB Serotonin (5-HT) receptor Serotonin Receptor 1B
Type:
G Protein-Coupled Receptor (GPCR)
Mol. Mass.:
43579.17
Organism:
Homo sapiens (Human)
Description:
Receptor binding assays were performed using human clone stably expressed in CHO cells
Residue:
390
  
Inhibitor
Name:
BDBM50171235
Synonyms:
5-Chloro-2-methyl-3-(1,2,3,6-tetrahydro-pyridin-4-yl)-1H-indole | CHEMBL364005
Type:
Small organic molecule
Emp. Form.:
C14H15ClN2
Mol. Mass.:
246.735
SMILES:
Cc1[nH]c2ccc(Cl)cc2c1C1=CCNCC1
: