Target
Corticotropin-releasing factor receptor 1
Ligand
BDBM50171316
Substrate
Meas. Tech.
ChEMBL_303781 (CHEMBL830138)
Ki
8±n/a nM
Citation
 Guo, ZTellew, JEGross, RSDyck, BGrey, JHaddach, MKiankarimi, MLanier, MLi, BFLuo, ZMcCarthy, JRMoorjani, MSaunders, JSullivan, RZhang, XZamani-Kord, SGrigoriadis, DECrowe, PDChen, TKWilliams, JP Design and synthesis of tricyclic imidazo[4,5-b]pyridin-2-ones as corticotropin-releasing factor-1 antagonists. J Med Chem 48:5104-7 (2005)  
Target
Name:
Corticotropin-releasing factor receptor 1
Synonyms:
CRF-R CRF1 CRFR1 CRH-R 1 CRHR1 Corticotropin-releasing factor receptor 1 (CRF-1) Corticotropin-releasing hormone receptor 1
Type:
Enzyme
Mol. Mass.:
50744.31
Organism:
Homo sapiens (Human)
Description:
P34998
Residue:
444
  
Inhibitor
Name:
BDBM50171316
Synonyms:
5-(1-Ethyl-propyl)-1-(4-methoxy-phenyl)-7-methyl-4,5-dihydro-1H,3H-1,2a,5,8-tetraaza-acenaphthylen-2-one | CHEMBL364680
Type:
Small organic molecule
Emp. Form.:
C21H26N4O2
Mol. Mass.:
366.4567
SMILES:
CCC(CC)N1CCn2c3c1cc(C)nc3n(-c1ccc(OC)cc1)c2=O
: