Target
Steryl-sulfatase
Ligand
BDBM50171447
Substrate
Meas. Tech.
ChEMBL_305541 (CHEMBL828561)
IC50
1800±n/a nM
Citation
 Leese, MPHejaz, HAMahon, MFNewman, SPPurohit, AReed, MJPotter, BV A-ring-substituted estrogen-3-O-sulfamates: potent multitargeted anticancer agents. J Med Chem 48:5243-56 (2005)  
Target
Name:
Steryl-sulfatase
Synonyms:
ARSC1 Arylsulfatase C STS_HUMAN Steryl-sulfate sulfohydrolase
Type:
Enzyme
Mol. Mass.:
65503.66
Organism:
Homo sapiens (Human)
Description:
P08842
Residue:
583
  
Inhibitor
Name:
BDBM50171447
Synonyms:
(8R,9S,13S,14S)-2-Ethyl-13-methyl-17-oxo-7,8,9,11,12,13,14,15,16,17-decahydro-6H-cyclopenta[a]phenanthrene-3-sulfonic acid amide | CHEMBL190451
Type:
Small organic molecule
Emp. Form.:
C20H27NO4S
Mol. Mass.:
377.498
SMILES:
CCc1cc2[C@H]3CC[C@@]4(C)[C@@H](CCC4=O)[C@@H]3CCc2cc1OS(N)(=O)=O
: