Target
Steryl-sulfatase
Ligand
BDBM50171448
Substrate
Meas. Tech.
ChEMBL_305541 (CHEMBL828561)
IC50
34±n/a nM
Citation
 Leese, MPHejaz, HAMahon, MFNewman, SPPurohit, AReed, MJPotter, BV A-ring-substituted estrogen-3-O-sulfamates: potent multitargeted anticancer agents. J Med Chem 48:5243-56 (2005)  
Target
Name:
Steryl-sulfatase
Synonyms:
ARSC1 Arylsulfatase C STS_HUMAN Steryl-sulfate sulfohydrolase
Type:
Enzyme
Mol. Mass.:
65503.66
Organism:
Homo sapiens (Human)
Description:
P08842
Residue:
583
  
Inhibitor
Name:
BDBM50171448
Synonyms:
(9BETA,14BETA,17BETA)-17-HYDROXY-2-METHOXYESTRA-1,3,5(10)-TRIEN-3-YL SULFAMATE CHEMBL190628 | Sulfamic acid (11R,12S,15S,16S)-17-(S)-hydroxy-2-methoxy-13-methyl-7,8,9,11,12,13,14,15,16,17-decahydro-6H-cyclopenta[a]phenanthren-3-yl ester
Type:
Small organic molecule
Emp. Form.:
C19H27NO5S
Mol. Mass.:
381.486
SMILES:
COc1cc2[C@H]3CC[C@]4(C)[C@@H](O)CC[C@H]4[C@@H]3CCc2cc1OS(N)(=O)=O
: