Target
Pituitary adenylate cyclase-activating polypeptide type I receptor
Ligand
BDBM50596675
Substrate
Meas. Tech.
ChEMBL_2221684 (CHEMBL5135018)
IC50
1.5±n/a nM
Citation
 Takasaki, IWatanabe, AOkada, TKanayama, DNagashima, RShudo, MShimodaira, ANunomura, KLin, BWatanabe, YGouda, HMiyata, AKurihara, TToyooka, N Design and synthesis of pyrido[2,3-d]pyrimidine derivatives for a novel PAC1 receptor antagonist. Eur J Med Chem 231:0 (2022) Target
Name:
Pituitary adenylate cyclase-activating polypeptide type I receptor
Synonyms:
ADCYAP1R1 | PACR_HUMAN
Type:
PROTEIN
Mol. Mass.:
53307.50
Organism:
Homo sapiens (Human)
Description:
ChEMBL_498617
Residue:
468
  
Inhibitor
Name:
BDBM50596675
Synonyms:
CHEMBL5208587
Type:
Small organic molecule
Emp. Form.:
C17H18N4O4
Mol. Mass.:
342.3492
SMILES:
COc1cc(ccc1OCC=C)C1CC(=O)Nc2nc(N)[nH]c(=O)c12
: