Target
Transient receptor potential cation channel subfamily V member 1
Ligand
BDBM20321
Substrate
Meas. Tech.
ChEMBL_321588 (CHEMBL884696)
IC50
54±n/a nM
Citation
 Suh, YGLee, YSMin, KHPark, OHKim, JKSeung, HSSeo, SYLee, BYNam, YHLee, KOKim, HDPark, HGLee, JOh, ULim, JOKang, SUKil, MJKoo, JYShin, SSJoo, YHKim, JKJeong, YSKim, SYPark, YH Novel potent antagonists of transient receptor potential channel, vanilloid subfamily member 1: structure-activity relationship of 1,3-diarylalkyl thioureas possessing new vanilloid equivalents. J Med Chem 48:5823-36 (2005)  
Target
Name:
Transient receptor potential cation channel subfamily V member 1
Synonyms:
Capsaicin receptor Osm-9-like TRP channel 1 TRPV1_HUMAN Transient receptor potential cation channel subfamily V member 1 (TRPV1) Transient receptor potential cation channel subfamily V member 1(TRPV1) Vanilloid VR1 Vanilloid receptor 1 Vanilloid receptor 1 (VRI/TRPV1)
Type:
Protein
Mol. Mass.:
94960.75
Organism:
Homo sapiens (Human)
Description:
Q8NER1
Residue:
839
  
Inhibitor
Name:
BDBM20321
Synonyms:
3-[(4-tert-butylphenyl)methyl]-1-[(3-fluoro-4-methanesulfonamidophenyl)methyl]thiourea JYL1421 | thiourea analogue, 2
Type:
Small organic molecule
Emp. Form.:
C20H26FN3O2S2
Mol. Mass.:
423.568
SMILES:
CC(C)(C)c1ccc(CNC(=S)NCc2ccc(NS(C)(=O)=O)c(F)c2)cc1
: