Target
Transient receptor potential cation channel subfamily V member 1
Ligand
BDBM50170264
Substrate
Meas. Tech.
ChEMBL_321505 (CHEMBL880565)
IC50
8.4±n/a nM
Citation
 Suh, YGLee, YSMin, KHPark, OHKim, JKSeung, HSSeo, SYLee, BYNam, YHLee, KOKim, HDPark, HGLee, JOh, ULim, JOKang, SUKil, MJKoo, JYShin, SSJoo, YHKim, JKJeong, YSKim, SYPark, YH Novel potent antagonists of transient receptor potential channel, vanilloid subfamily member 1: structure-activity relationship of 1,3-diarylalkyl thioureas possessing new vanilloid equivalents. J Med Chem 48:5823-36 (2005)  
Target
Name:
Transient receptor potential cation channel subfamily V member 1
Synonyms:
Capsaicin receptor TRPV1_RAT Trpv1 Vanilloid VR1 Vanilloid receptor 1 (VRI/TRPV1) Vanilloid receptor type 1-like (TrpV1/Vr1) Vr1l | osm-9-like TRP channel 1
Type:
Transient Receptor
Mol. Mass.:
94956.12
Organism:
Rattus norvegicus (rat)
Description:
O35433
Residue:
838
  
Inhibitor
Name:
BDBM50170264
Synonyms:
CHEMBL361931 | N-{4-[3-(4-tert-Butyl-benzyl)-thioureidomethyl]-2-chloro-phenyl}-methanesulfonamide
Type:
Small organic molecule
Emp. Form.:
C20H26ClN3O2S2
Mol. Mass.:
440.022
SMILES:
CC(C)(C)c1ccc(CNC(=S)NCc2ccc(NS(C)(=O)=O)c(Cl)c2)cc1
: