Target
DNA-dependent protein kinase catalytic subunit
Ligand
BDBM50178095
Substrate
Meas. Tech.
ChEMBL_326726 (CHEMBL858719)
IC50
1680±n/a nM
Citation
 Hardcastle, IRCockcroft, XCurtin, NJEl-Murr, MDLeahy, JJStockley, MGolding, BTRigoreau, LRichardson, CSmith, GCGriffin, RJ Discovery of potent chromen-4-one inhibitors of the DNA-dependent protein kinase (DNA-PK) using a small-molecule library approach. J Med Chem 48:7829-46 (2005)  
Target
Name:
DNA-dependent protein kinase catalytic subunit
Synonyms:
DNA-PK catalytic subunit DNA-dependent protein kinase (DNA-PK) DNA-dependent protein kinase catalytic subunit (DNA-PK) HYRC PRKDC | PRKDC_HUMAN
Type:
Protein
Mol. Mass.:
469114.78
Organism:
Homo sapiens (Human)
Description:
P78527
Residue:
4128
  
Inhibitor
Name:
BDBM50178095
Synonyms:
7-benzoyloxy-2-(morpholin-4-yl)-chromen-4-one | CHEMBL198944
Type:
Small organic molecule
Emp. Form.:
C20H17NO5
Mol. Mass.:
351.3527
SMILES:
O=C(Oc1ccc2c(c1)oc(cc2=O)N1CCOCC1)c1ccccc1
: