Target
DNA-dependent protein kinase catalytic subunit
Ligand
BDBM50178084
Substrate
Meas. Tech.
ChEMBL_326726 (CHEMBL858719)
IC50
2000±n/a nM
Citation
 Hardcastle, IRCockcroft, XCurtin, NJEl-Murr, MDLeahy, JJStockley, MGolding, BTRigoreau, LRichardson, CSmith, GCGriffin, RJ Discovery of potent chromen-4-one inhibitors of the DNA-dependent protein kinase (DNA-PK) using a small-molecule library approach. J Med Chem 48:7829-46 (2005)  
Target
Name:
DNA-dependent protein kinase catalytic subunit
Synonyms:
DNA-PK catalytic subunit DNA-dependent protein kinase (DNA-PK) DNA-dependent protein kinase catalytic subunit (DNA-PK) HYRC PRKDC | PRKDC_HUMAN
Type:
Protein
Mol. Mass.:
469114.78
Organism:
Homo sapiens (Human)
Description:
P78527
Residue:
4128
  
Inhibitor
Name:
BDBM50178084
Synonyms:
8-(4-benzyloxyphenyl)-2-morpholin-4-ylchromen-4-one | CHEMBL371468
Type:
Small organic molecule
Emp. Form.:
C26H23NO4
Mol. Mass.:
413.4651
SMILES:
O=c1cc(oc2c(cccc12)-c1ccc(OCc2ccccc2)cc1)N1CCOCC1
: