Target
DNA-dependent protein kinase catalytic subunit
Ligand
BDBM50159639
Substrate
Meas. Tech.
ChEMBL_326726 (CHEMBL858719)
IC50
1380±n/a nM
Citation
 Hardcastle, IRCockcroft, XCurtin, NJEl-Murr, MDLeahy, JJStockley, MGolding, BTRigoreau, LRichardson, CSmith, GCGriffin, RJ Discovery of potent chromen-4-one inhibitors of the DNA-dependent protein kinase (DNA-PK) using a small-molecule library approach. J Med Chem 48:7829-46 (2005)  
Target
Name:
DNA-dependent protein kinase catalytic subunit
Synonyms:
DNA-PK catalytic subunit DNA-dependent protein kinase (DNA-PK) DNA-dependent protein kinase catalytic subunit (DNA-PK) HYRC PRKDC | PRKDC_HUMAN
Type:
Protein
Mol. Mass.:
469114.78
Organism:
Homo sapiens (Human)
Description:
P78527
Residue:
4128
  
Inhibitor
Name:
BDBM50159639
Synonyms:
2-Thiomorpholin-4-yl-benzo[h]chromen-4-one CHEMBL360038
Type:
Small organic molecule
Emp. Form.:
C17H15NO2S
Mol. Mass.:
297.371
SMILES:
O=c1cc(oc2c3ccccc3ccc12)N1CCSCC1
: