Target
DNA-dependent protein kinase catalytic subunit
Ligand
BDBM50178111
Substrate
Meas. Tech.
ChEMBL_326726 (CHEMBL858719)
IC50
470±n/a nM
Citation
 Hardcastle, IRCockcroft, XCurtin, NJEl-Murr, MDLeahy, JJStockley, MGolding, BTRigoreau, LRichardson, CSmith, GCGriffin, RJ Discovery of potent chromen-4-one inhibitors of the DNA-dependent protein kinase (DNA-PK) using a small-molecule library approach. J Med Chem 48:7829-46 (2005)  
Target
Name:
DNA-dependent protein kinase catalytic subunit
Synonyms:
DNA-PK catalytic subunit DNA-dependent protein kinase (DNA-PK) DNA-dependent protein kinase catalytic subunit (DNA-PK) HYRC PRKDC | PRKDC_HUMAN
Type:
Protein
Mol. Mass.:
469114.78
Organism:
Homo sapiens (Human)
Description:
P78527
Residue:
4128
  
Inhibitor
Name:
BDBM50178111
Synonyms:
2-(2-(benzenesulfonyl)ethoxy)-2-morpholin-4-yl-chromen-4-one | CHEMBL427194
Type:
Small organic molecule
Emp. Form.:
C21H21NO6S
Mol. Mass.:
415.46
SMILES:
O=c1cc(oc2cc(OCCS(=O)(=O)c3ccccc3)ccc12)N1CCOCC1
: