Target
DNA-dependent protein kinase catalytic subunit
Ligand
BDBM50178064
Substrate
Meas. Tech.
ChEMBL_326726 (CHEMBL858719)
IC50
1920±n/a nM
Citation
 Hardcastle, IRCockcroft, XCurtin, NJEl-Murr, MDLeahy, JJStockley, MGolding, BTRigoreau, LRichardson, CSmith, GCGriffin, RJ Discovery of potent chromen-4-one inhibitors of the DNA-dependent protein kinase (DNA-PK) using a small-molecule library approach. J Med Chem 48:7829-46 (2005)  
Target
Name:
DNA-dependent protein kinase catalytic subunit
Synonyms:
DNA-PK catalytic subunit DNA-dependent protein kinase (DNA-PK) DNA-dependent protein kinase catalytic subunit (DNA-PK) HYRC PRKDC | PRKDC_HUMAN
Type:
Protein
Mol. Mass.:
469114.78
Organism:
Homo sapiens (Human)
Description:
P78527
Residue:
4128
  
Inhibitor
Name:
BDBM50178064
Synonyms:
7-(3-bromobenzyloxy)-2-morpholin-4-yl-chromen-4-one | CHEMBL199165
Type:
Small organic molecule
Emp. Form.:
C20H18BrNO4
Mol. Mass.:
416.265
SMILES:
Brc1cccc(COc2ccc3c(c2)oc(cc3=O)N2CCOCC2)c1
: