Target
Adenosine receptor A3
Ligand
BDBM50182312
Substrate
Meas. Tech.
ChEMBL_349357 (CHEMBL865062)
Ki
2.5±n/a nM
Citation
 DeNinno, MPMasamune, HChenard, LKDiRico, KJEller, CEtienne, JBTickner, JEKennedy, SPKnight, DRKong, JOleynek, JJTracey, WRHill, RJ The synthesis of highly potent, selective, and water-soluble agonists at the human adenosine A3 receptor. Bioorg Med Chem Lett 16:2525-7 (2006)  
Target
Name:
Adenosine receptor A3
Synonyms:
A3 adenosine receptor (hA3) ADORA3 | Adenosine A3 receptor (A3AR)
Type:
G Protein-Coupled Receptor (GPCR)
Mol. Mass.:
36197.32
Organism:
Homo sapiens (Human)
Description:
P0DMS8
Residue:
318
  
Inhibitor
Name:
BDBM50182312
Synonyms:
(2S,3S,4R,5R)-5-(6-(3,5-dichlorobenzylamino)-9H-purin-9-yl)-3,4-dihydroxy-N-methyl-tetrahydrofuran-2-carboxamide | CHEMBL207808
Type:
Small organic molecule
Emp. Form.:
C18H18Cl2N6O4
Mol. Mass.:
453.279
SMILES:
CNC(=O)[C@H]1O[C@H]([C@H](O)[C@@H]1O)n1cnc2c(NCc3cc(Cl)cc(Cl)c3)ncnc12
: