Target
Ubiquitin carboxyl-terminal hydrolase 7
Ligand
BDBM50602280
Substrate
Meas. Tech.
ChEMBL_2239883 (CHEMBL5153779)
IC50
18±n/a nM
Citation
 Li, XYang, SZhang, HLiu, XGao, YChen, YLiu, LWang, DLiang, ZLiu, SDai, LXu, QYuan, HChen, CSun, HWen, X Discovery of Orally Bioavailable  J Med Chem 65:16622-16639 (2022) Target
Name:
Ubiquitin carboxyl-terminal hydrolase 7
Synonyms:
Deubiquitinating enzyme 7 Herpesvirus-associated ubiquitin-specific protease USP7 Ubiquitin-specific-processing protease 7
Type:
PROTEIN
Mol. Mass.:
128274.45
Organism:
Homo sapiens (Human)
Description:
ChEMBL_1469483
Residue:
1102
  
Inhibitor
Name:
BDBM50602280
Synonyms:
CHEMBL5180062
Type:
Small organic molecule
Emp. Form.:
C30H33Cl3N6O3
Mol. Mass.:
631.98
SMILES:
Cl.Cl.Cn1nc2c(ncn(CC3(O)CCN(Cc4ccc(cc4Cl)-c4ccco4)CC3)c2=O)c1-c1ccc(CN)cc1
: