Target
Ubiquitin carboxyl-terminal hydrolase 7
Ligand
BDBM50465231
Substrate
Meas. Tech.
ChEMBL_2239883 (CHEMBL5153779)
IC50
18±n/a nM
Citation
 Li, XYang, SZhang, HLiu, XGao, YChen, YLiu, LWang, DLiang, ZLiu, SDai, LXu, QYuan, HChen, CSun, HWen, X Discovery of Orally Bioavailable  J Med Chem 65:16622-16639 (2022) Target
Name:
Ubiquitin carboxyl-terminal hydrolase 7
Synonyms:
Deubiquitinating enzyme 7 Herpesvirus-associated ubiquitin-specific protease USP7 Ubiquitin-specific-processing protease 7
Type:
PROTEIN
Mol. Mass.:
128274.45
Organism:
Homo sapiens (Human)
Description:
ChEMBL_1469483
Residue:
1102
  
Inhibitor
Name:
BDBM50465231
Synonyms:
CHEMBL4288150 | US10766903, Example 30
Type:
Small organic molecule
Emp. Form.:
C29H34N6O3
Mol. Mass.:
514.6187
SMILES:
C[C@H](CC(=O)N1CCC(O)(Cn2cnc3c(-c4ccc(CN)cc4)n(C)nc3c2=O)CC1)c1ccccc1
: