Target
Ubiquitin carboxyl-terminal hydrolase 7
Ligand
BDBM50602285
Substrate
Meas. Tech.
ChEMBL_2239883 (CHEMBL5153779)
IC50
7.6±n/a nM
Citation
 Li, XYang, SZhang, HLiu, XGao, YChen, YLiu, LWang, DLiang, ZLiu, SDai, LXu, QYuan, HChen, CSun, HWen, X Discovery of Orally Bioavailable  J Med Chem 65:16622-16639 (2022) Target
Name:
Ubiquitin carboxyl-terminal hydrolase 7
Synonyms:
Deubiquitinating enzyme 7 Herpesvirus-associated ubiquitin-specific protease USP7 Ubiquitin-specific-processing protease 7
Type:
PROTEIN
Mol. Mass.:
128274.45
Organism:
Homo sapiens (Human)
Description:
ChEMBL_1469483
Residue:
1102
  
Inhibitor
Name:
BDBM50602285
Synonyms:
CHEMBL5182862
Type:
Small organic molecule
Emp. Form.:
C31H33ClN6O3
Mol. Mass.:
573.085
SMILES:
CNCc1ccc(cc1)-c1n(C)nc2c1ncn(CC1(O)CCN(Cc3ccc(cc3Cl)-c3ccco3)CC1)c2=O
: