Target
Ubiquitin carboxyl-terminal hydrolase 7
Ligand
BDBM50602291
Substrate
Meas. Tech.
ChEMBL_2239883 (CHEMBL5153779)
IC50
8.2±n/a nM
Citation
 Li, XYang, SZhang, HLiu, XGao, YChen, YLiu, LWang, DLiang, ZLiu, SDai, LXu, QYuan, HChen, CSun, HWen, X Discovery of Orally Bioavailable  J Med Chem 65:16622-16639 (2022) Target
Name:
Ubiquitin carboxyl-terminal hydrolase 7
Synonyms:
Deubiquitinating enzyme 7 Herpesvirus-associated ubiquitin-specific protease USP7 Ubiquitin-specific-processing protease 7
Type:
PROTEIN
Mol. Mass.:
128274.45
Organism:
Homo sapiens (Human)
Description:
ChEMBL_1469483
Residue:
1102
  
Inhibitor
Name:
BDBM50602291
Synonyms:
CHEMBL5200808
Type:
Small organic molecule
Emp. Form.:
C32H37Cl3N6O4
Mol. Mass.:
676.033
SMILES:
Cl.Cl.Cn1nc2c(ncn(CC3(O)CCN(Cc4ccc(cc4Cl)-c4ccco4)CC3)c2=O)c1-c1ccc(CNCCO)cc1
: