Target
UDP-glucuronosyltransferase 2B17
Ligand
BDBM50183611
Substrate
Meas. Tech.
ChEMBL_339084 (CHEMBL869551)
Ki
190000±n/a nM
Citation
 Bichlmaier, ISiiskonen, AFinel, MYli-Kauhaluoma, J Stereochemical sensitivity of the human UDP-glucuronosyltransferases 2B7 and 2B17. J Med Chem 49:1818-27 (2006)  
Target
Name:
UDP-glucuronosyltransferase 2B17
Synonyms:
UDB17_HUMAN | UGT2B17
Type:
PROTEIN
Mol. Mass.:
61109.88
Organism:
Homo sapiens (Human)
Description:
ChEMBL_436440
Residue:
530
  
Inhibitor
Name:
BDBM50183611
Synonyms:
(rac)-5,7-dimethyl-1,2,3,4-tetrahydronaphthalen-1-ol | CHEMBL206457
Type:
Small organic molecule
Emp. Form.:
C12H16O
Mol. Mass.:
176.2548
SMILES:
Cc1cc(C)c2CCCC(O)c2c1
: