Target
Melanocortin receptor 5
Ligand
BDBM50027084
Substrate
Meas. Tech.
ChEMBL_2245293 (CHEMBL5159503)
EC50
1.7±n/a nM
Citation
 Tomassi, SDimmito, MPCai, MD'Aniello, ADel Bene, AMessere, ALiu, ZZhu, THruby, VJStefanucci, ACosconati, SMollica, ADi Maro, S CLIPSing Melanotan-II to Discover Multiple Functionally Selective hMCR Agonists. J Med Chem 65:4007-4017 (2022) Target
Name:
Melanocortin receptor 5
Synonyms:
MC-2 MC5R Melanocortin MC5 Melanocortin receptor 5 | Melanocortin receptor 5 (MC5R)
Type:
Enzyme
Mol. Mass.:
36612.92
Organism:
Homo sapiens (Human)
Description:
P33032
Residue:
325
  
Inhibitor
Name:
BDBM50027084
Synonyms:
Melatonan
Type:
Small organic molecule
Emp. Form.:
C50H69N15O9
Mol. Mass.:
1024.178
SMILES:
CCCC[C@H](NC(C)=O)C(=O)N[C@H]1CC(=O)NCCCC[C@H](NC(=O)[C@H](Cc2c[nH]c3ccccc23)NC(=O)[C@H](CCCNC(N)=N)NC(=O)[C@@H](Cc2ccccc2)NC(=O)[C@H](Cc2cnc[nH]2)NC1=O)C(N)=O
: