Target
Atrial natriuretic peptide receptor 3
Ligand
BDBM50604586
Substrate
Meas. Tech.
ChEMBL_2248299 (CHEMBL5162509)
Kd
29600±n/a nM
Citation
 Smith, RJPerez-Ternero, CConole, DMartin, CMyers, SHHobbs, AJSelwood, DL A Series of Substituted Bis-Aminotriazines Are Activators of the Natriuretic Peptide Receptor C. J Med Chem 65:5495-5513 (2022) Target
Name:
Atrial natriuretic peptide receptor 3
Synonyms:
ANP-C ANPRC Atrial natriuretic peptide C-type receptor Atrial natriuretic peptide receptor C5orf23 NPR3 | NPRC
Type:
PROTEIN
Mol. Mass.:
59805.12
Organism:
Homo sapiens (Human)
Description:
ChEMBL_34991
Residue:
541
  
Inhibitor
Name:
BDBM50604586
Synonyms:
CHEMBL5191995
Type:
Small organic molecule
Emp. Form.:
C25H30N6O3
Mol. Mass.:
462.5441
SMILES:
CC(=O)Nc1ccc(Nc2ncnc(N[C@H](COC(=O)C(C)(C)C)Cc3ccccc3)n2)cc1
: