Target
Muscarinic acetylcholine receptor M5
Ligand
BDBM50605085
Substrate
Meas. Tech.
ChEMBL_2250342 (CHEMBL5164552)
IC50
125±n/a nM
Target
Name:
Muscarinic acetylcholine receptor M5
Synonyms:
ACM5_RAT Chrm-5 Muscarinic acetylcholine receptor | Muscarinic acetylcholine receptor M5
Type:
Enzyme Catalytic Domain
Mol. Mass.:
60161.80
Organism:
RAT
Description:
Cholinergic, muscarinic M5 CHRM5 RAT::P08911
Residue:
531
  
Inhibitor
Name:
BDBM50605085
Synonyms:
CHEMBL5204021
Type:
Small organic molecule
Emp. Form.:
C18H22FN3O3S2
Mol. Mass.:
411.514
SMILES:
Cn1ccnc1SC[C@H]1CCN(C[C@@H]1F)S(=O)(=O)c1ccc2OCCc2c1
: