Target
C-C chemokine receptor type 2
Ligand
BDBM50187039
Substrate
Meas. Tech.
ChEMBL_375682 (CHEMBL863683)
Ki
29±n/a nM
Citation
 Yang, LZhou, CGuo, LMorriello, GButora, GPasternak, AParsons, WHMills, SGMacCoss, MVicario, PPZweerink, HAyala, JMGoyal, SHanlon, WACascieri, MASpringer, MS Discovery of 3,5-bis(trifluoromethyl)benzyl L-arylglycinamide based potent CCR2 antagonists. Bioorg Med Chem Lett 16:3735-9 (2006)  
Target
Name:
C-C chemokine receptor type 2
Synonyms:
C-C chemokine receptor type 2 (CCR2) CCR2_HUMAN Chemoattractant Cytokine Receptor 2 (CCR2) Monocyte chemotactic protein-1 (MCP-1)
Type:
Enzyme
Mol. Mass.:
41932.32
Organism:
Homo sapiens (Human)
Description:
P41597
Residue:
374
  
Inhibitor
Name:
BDBM50187039
Synonyms:
1-(3,4-dichlorobenzyl)-5-hydroxy-1H-indole-2-carboxylic acid | CHEMBL376981
Type:
Small organic molecule
Emp. Form.:
C16H11Cl2NO3
Mol. Mass.:
336.169
SMILES:
OC(=O)c1cc2cc(O)ccc2n1Cc1ccc(Cl)c(Cl)c1
: