Target
Sigma intracellular receptor 2
Ligand
BDBM50606398
Substrate
Meas. Tech.
ChEMBL_2254790 (CHEMBL5169000)
Ki
244±n/a nM
Citation
 Frankowski, KJPatnaik, SWang, CSouthall, NDutta, DDe, SLi, DDextras, CLin, YHBryant-Connah, MDavis, DWang, FWachsmuth, LMShah, PWilliams, JKabir, MZhu, EBaljinnyam, BWang, AXu, XNorton, JFerrer, MTitus, SSimeonov, AZheng, WMathews Griner, LAJadhav, AAubé, JHenderson, MJRudloff, USchoenen, FJHuang, SMarugan, JJ Discovery and Optimization of Pyrrolopyrimidine Derivatives as Selective Disruptors of the Perinucleolar Compartment, a Marker of Tumor Progression toward Metastasis. J Med Chem 65:8303-8331 (2022) Target
Name:
Sigma intracellular receptor 2
Synonyms:
MAC30 S2R Sigma-2 receptor TMEM97 | Transmembrane protein 97
Type:
Protein
Mol. Mass.:
20857.20
Organism:
Homo sapiens (Human)
Description:
Q5BJF2
Residue:
176
  
Inhibitor
Name:
BDBM50606398
Synonyms:
ML-246 Ml-246
Type:
Small organic molecule
Emp. Form.:
C31H30N4O
Mol. Mass.:
474.5961
SMILES:
O[C@H]1CC[C@@H](CC1)n1cnc2n(Cc3ccccc3)c(c(-c3ccccc3)c2c1=N)-c1ccccc1
: