Target
Melanocortin receptor 4
Ligand
BDBM50189010
Substrate
Meas. Tech.
ChEMBL_395997 (CHEMBL910342)
EC50
0.20±n/a nM
Citation
 Tian, XMishra, RKSwitzer, AGHu, XEKim, NMazur, AWEbetino, FHWos, JACrossdoersen, DPinney, BBFarmer, JASheldon, RJ Design and synthesis of potent and selective 1,3,4-trisubstituted-2-oxopiperazine based melanocortin-4 receptor agonists. Bioorg Med Chem Lett 16:4668-73 (2006)  
Target
Name:
Melanocortin receptor 4
Synonyms:
MC4-R MC4R_HUMAN Melanocortin receptor 4 (MC-4) Melanocortin receptor 4 (MC4R)
Type:
Enzyme
Mol. Mass.:
36949.50
Organism:
Homo sapiens (Human)
Description:
P32245
Residue:
332
  
Inhibitor
Name:
BDBM50189010
Synonyms:
(S)-2-[(S)-4-{(R)-2-[(S)-2-acetylamino-3-(4-hydroxy-phenyl)-propionylamino]-3-phenyl-propionyl}-3-(3-guanidino-propyl)-2-oxo-piperazin-1-yl]-N-methyl-3-naphthalen-2-yl-propionamide | CHEMBL379054
Type:
Small organic molecule
Emp. Form.:
C42H50N8O6
Mol. Mass.:
762.8964
SMILES:
[#6]-[#7]-[#6](=O)-[#6@H](-[#6]-c1ccc2ccccc2c1)-[#7]-1-[#6]-[#6]-[#7](-[#6@@H](-[#6]-[#6]-[#6]\[#7]=[#6](\[#7])-[#7])-[#6]-1=O)-[#6](=O)-[#6@@H](-[#6]-c1ccccc1)-[#7]-[#6](=O)-[#6@H](-[#6]-c1ccc(-[#8])cc1)-[#7]-[#6](-[#6])=O
: