Target
Hypoxia-inducible factor 1-alpha inhibitor
Ligand
BDBM50606688
Substrate
Meas. Tech.
ChEMBL_2261094 (CHEMBL5216105)
IC50
18400±n/a nM
Citation
 Shishodia, SDemetriades, MZhang, DTam, NYMaheswaran, PClunie-O'Connor, CTumber, ALeung, IKHNg, YMLeissing, TMEl-Sagheer, AHSalah, EBrown, TAik, WSMcDonough, MASchofield, CJ Structure-Based Design of Selective Fat Mass and Obesity Associated Protein (FTO) Inhibitors. J Med Chem 64:16609-16625 (2021) Target
Name:
Hypoxia-inducible factor 1-alpha inhibitor
Synonyms:
FIH1 HIF1N_HUMAN Hypoxia-inducible factor 1-alpha inhibitor
Type:
Enzyme
Mol. Mass.:
40278.92
Organism:
Homo sapiens (Human)
Description:
Q9NWT6
Residue:
349
  
Inhibitor
Name:
BDBM50606688
Synonyms:
CHEMBL5218469
Type:
Small organic molecule
Emp. Form.:
C18H15N3O4
Mol. Mass.:
337.3294
SMILES:
OC(=O)CNC(=O)c1nc(Nc2ccc3ccccc3c2)ccc1O
: