Target
Hypoxia-inducible factor 1-alpha inhibitor
Ligand
BDBM50606687
Substrate
Meas. Tech.
ChEMBL_2261094 (CHEMBL5216105)
IC50
40700±n/a nM
Citation
 Shishodia, SDemetriades, MZhang, DTam, NYMaheswaran, PClunie-O'Connor, CTumber, ALeung, IKHNg, YMLeissing, TMEl-Sagheer, AHSalah, EBrown, TAik, WSMcDonough, MASchofield, CJ Structure-Based Design of Selective Fat Mass and Obesity Associated Protein (FTO) Inhibitors. J Med Chem 64:16609-16625 (2021) Target
Name:
Hypoxia-inducible factor 1-alpha inhibitor
Synonyms:
FIH1 HIF1N_HUMAN Hypoxia-inducible factor 1-alpha inhibitor
Type:
Enzyme
Mol. Mass.:
40278.92
Organism:
Homo sapiens (Human)
Description:
Q9NWT6
Residue:
349
  
Inhibitor
Name:
BDBM50606687
Synonyms:
CHEMBL5220246
Type:
Small organic molecule
Emp. Form.:
C17H18N4O5
Mol. Mass.:
358.3486
SMILES:
CN(C)C(=O)c1ccc(Nc2ccc(O)c(n2)C(=O)NCC(O)=O)cc1
: