Target
Muscarinic acetylcholine receptor M5
Ligand
BDBM50606944
Substrate
Meas. Tech.
ChEMBL_2261711 (CHEMBL5216722)
IC50
249±n/a nM
Citation
 Capstick, RAWhomble, DOrsi, DLFelts, ASRodriguez, ALVinson, PNChang, SBlobaum, ALNiswender, CMConn, PJJones, CKLindsley, CWHan, C Discovery of a potent M Bioorg Med Chem Lett 76:0 (2022) Target
Name:
Muscarinic acetylcholine receptor M5
Synonyms:
ACM5_RAT Chrm-5 Muscarinic acetylcholine receptor | Muscarinic acetylcholine receptor M5
Type:
Enzyme Catalytic Domain
Mol. Mass.:
60161.80
Organism:
RAT
Description:
Cholinergic, muscarinic M5 CHRM5 RAT::P08911
Residue:
531
  
Inhibitor
Name:
BDBM50606944
Synonyms:
CHEMBL5219691
Type:
Small organic molecule
Emp. Form.:
C21H21N3O4S2
Mol. Mass.:
443.539
SMILES:
O=C(Nc1ccc2scnc2c1)C1CCN(CC1)S(=O)(=O)c1ccc2OCCc2c1
: