Target
Neprilysin
Ligand
BDBM50190738
Substrate
Meas. Tech.
ChEMBL_369150 (CHEMBL862877)
IC50
120±n/a nM
Citation
 Pryde, DCMaw, GNPlanken, SPlatts, MYSanderson, VCorless, MStobie, ABarber, CGRussell, RFoster, LBarker, LWayman, CVan Der Graaf, PStacey, PMorren, DKohl, CBeaumont, KCoggon, STute, M Novel selective inhibitors of neutral endopeptidase for the treatment of female sexual arousal disorder. Synthesis and activity of functionalized glutaramides. J Med Chem 49:4409-24 (2006)  
Target
Name:
Neprilysin
Synonyms:
Atriopeptidase CD_antigen=CD10 EPN MME NEP_HUMAN Neutral endopeptidase | Neutral endopeptidase 24.11
Type:
Enzyme
Mol. Mass.:
85505.38
Organism:
Homo sapiens (Human)
Description:
P08473
Residue:
750
  
Inhibitor
Name:
BDBM50190738
Synonyms:
2-((1-((5-ethyl-1,3,4-thiadiazol-2-yl)carbamoyl)cyclopentyl)methyl)-5-methylhexanoic acid | CHEMBL213281
Type:
Small organic molecule
Emp. Form.:
C18H29N3O3S
Mol. Mass.:
367.506
SMILES:
CCc1nnc(NC(=O)C2(CC(CCC(C)C)C(O)=O)CCCC2)s1
: