Target
Acetylcholinesterase
Ligand
BDBM50190739
Substrate
Meas. Tech.
ChEMBL_369156 (CHEMBL862883)
IC50
>3000±n/a nM
Citation
 Pryde, DCMaw, GNPlanken, SPlatts, MYSanderson, VCorless, MStobie, ABarber, CGRussell, RFoster, LBarker, LWayman, CVan Der Graaf, PStacey, PMorren, DKohl, CBeaumont, KCoggon, STute, M Novel selective inhibitors of neutral endopeptidase for the treatment of female sexual arousal disorder. Synthesis and activity of functionalized glutaramides. J Med Chem 49:4409-24 (2006)  
Target
Name:
Acetylcholinesterase
Synonyms:
ACES_HUMAN Acetylcholinesterase (AChE) | Acetylcholinesterase (human AChE)
Type:
Enzyme
Mol. Mass.:
67792.70
Organism:
Homo sapiens (Human)
Description:
P22303
Residue:
614
  
Inhibitor
Name:
BDBM50190739
Synonyms:
(R)-2-((1-((5-methyl-1,3,4-thiadiazol-2-yl)carbamoyl)cyclopentyl)methyl)pentanoic acid | CHEMBL378762
Type:
Small organic molecule
Emp. Form.:
C15H23N3O3S
Mol. Mass.:
325.426
SMILES:
CCC[C@H](CC1(CCCC1)C(=O)Nc1nnc(C)s1)C(O)=O
: