Target
Neprilysin
Ligand
BDBM50190749
Substrate
Meas. Tech.
ChEMBL_369150 (CHEMBL862877)
IC50
1710±n/a nM
Citation
 Pryde, DCMaw, GNPlanken, SPlatts, MYSanderson, VCorless, MStobie, ABarber, CGRussell, RFoster, LBarker, LWayman, CVan Der Graaf, PStacey, PMorren, DKohl, CBeaumont, KCoggon, STute, M Novel selective inhibitors of neutral endopeptidase for the treatment of female sexual arousal disorder. Synthesis and activity of functionalized glutaramides. J Med Chem 49:4409-24 (2006)  
Target
Name:
Neprilysin
Synonyms:
Atriopeptidase CD_antigen=CD10 EPN MME NEP_HUMAN Neutral endopeptidase | Neutral endopeptidase 24.11
Type:
Enzyme
Mol. Mass.:
85505.38
Organism:
Homo sapiens (Human)
Description:
P08473
Residue:
750
  
Inhibitor
Name:
BDBM50190749
Synonyms:
2-((1-((1-(hydroxymethyl)cyclopentyl)carbamoyl)cyclopentyl)methyl)pentanoic acid | CHEMBL212065
Type:
Small organic molecule
Emp. Form.:
C18H31NO4
Mol. Mass.:
325.443
SMILES:
CCCC(CC1(CCCC1)C(=O)NC1(CO)CCCC1)C(O)=O
: