Target
Neprilysin
Ligand
BDBM50190765
Substrate
Meas. Tech.
ChEMBL_369150 (CHEMBL862877)
IC50
1500±n/a nM
Citation
 Pryde, DCMaw, GNPlanken, SPlatts, MYSanderson, VCorless, MStobie, ABarber, CGRussell, RFoster, LBarker, LWayman, CVan Der Graaf, PStacey, PMorren, DKohl, CBeaumont, KCoggon, STute, M Novel selective inhibitors of neutral endopeptidase for the treatment of female sexual arousal disorder. Synthesis and activity of functionalized glutaramides. J Med Chem 49:4409-24 (2006)  
Target
Name:
Neprilysin
Synonyms:
Atriopeptidase CD_antigen=CD10 EPN MME NEP_HUMAN Neutral endopeptidase | Neutral endopeptidase 24.11
Type:
Enzyme
Mol. Mass.:
85505.38
Organism:
Homo sapiens (Human)
Description:
P08473
Residue:
750
  
Inhibitor
Name:
BDBM50190765
Synonyms:
2-((1-((benzo[d][1,3]dioxol-5-ylmethyl)carbamoyl)cyclopentyl)methyl)pentanoic acid | CHEMBL386053
Type:
Small organic molecule
Emp. Form.:
C20H27NO5
Mol. Mass.:
361.4321
SMILES:
CCCC(CC1(CCCC1)C(=O)NCc1ccc2OCOc2c1)C(O)=O
: