Target
Neprilysin
Ligand
BDBM50190768
Substrate
Meas. Tech.
ChEMBL_369150 (CHEMBL862877)
IC50
>2000±n/a nM
Citation
 Pryde, DCMaw, GNPlanken, SPlatts, MYSanderson, VCorless, MStobie, ABarber, CGRussell, RFoster, LBarker, LWayman, CVan Der Graaf, PStacey, PMorren, DKohl, CBeaumont, KCoggon, STute, M Novel selective inhibitors of neutral endopeptidase for the treatment of female sexual arousal disorder. Synthesis and activity of functionalized glutaramides. J Med Chem 49:4409-24 (2006)  
Target
Name:
Neprilysin
Synonyms:
Atriopeptidase CD_antigen=CD10 EPN MME NEP_HUMAN Neutral endopeptidase | Neutral endopeptidase 24.11
Type:
Enzyme
Mol. Mass.:
85505.38
Organism:
Homo sapiens (Human)
Description:
P08473
Residue:
750
  
Inhibitor
Name:
BDBM50190768
Synonyms:
2-((1-((6-ethylpyridin-2-yl)carbamoyl)cyclopentyl)methyl)pentanoic acid | CHEMBL377415
Type:
Small organic molecule
Emp. Form.:
C19H28N2O3
Mol. Mass.:
332.4372
SMILES:
CCCC(CC1(CCCC1)C(=O)Nc1cccc(CC)n1)C(O)=O
: