Target
Neprilysin
Ligand
BDBM50190769
Substrate
Meas. Tech.
ChEMBL_369150 (CHEMBL862877)
IC50
96±n/a nM
Citation
 Pryde, DCMaw, GNPlanken, SPlatts, MYSanderson, VCorless, MStobie, ABarber, CGRussell, RFoster, LBarker, LWayman, CVan Der Graaf, PStacey, PMorren, DKohl, CBeaumont, KCoggon, STute, M Novel selective inhibitors of neutral endopeptidase for the treatment of female sexual arousal disorder. Synthesis and activity of functionalized glutaramides. J Med Chem 49:4409-24 (2006)  
Target
Name:
Neprilysin
Synonyms:
Atriopeptidase CD_antigen=CD10 EPN MME NEP_HUMAN Neutral endopeptidase | Neutral endopeptidase 24.11
Type:
Enzyme
Mol. Mass.:
85505.38
Organism:
Homo sapiens (Human)
Description:
P08473
Residue:
750
  
Inhibitor
Name:
BDBM50190769
Synonyms:
CHEMBL377037 | rac-2-((1-((2-(hydroxymethyl)-2,3-dihydro-1H-inden-2-yl)carbamoyl)cyclopentyl)methyl)pentanoic acid
Type:
Small organic molecule
Emp. Form.:
C22H31NO4
Mol. Mass.:
373.4858
SMILES:
CCCC(CC1(CCCC1)C(=O)NC1(CO)Cc2ccccc2C1)C(O)=O
: