Target
Neprilysin
Ligand
BDBM50190779
Substrate
Meas. Tech.
ChEMBL_369150 (CHEMBL862877)
IC50
1139±n/a nM
Citation
 Pryde, DCMaw, GNPlanken, SPlatts, MYSanderson, VCorless, MStobie, ABarber, CGRussell, RFoster, LBarker, LWayman, CVan Der Graaf, PStacey, PMorren, DKohl, CBeaumont, KCoggon, STute, M Novel selective inhibitors of neutral endopeptidase for the treatment of female sexual arousal disorder. Synthesis and activity of functionalized glutaramides. J Med Chem 49:4409-24 (2006)  
Target
Name:
Neprilysin
Synonyms:
Atriopeptidase CD_antigen=CD10 EPN MME NEP_HUMAN Neutral endopeptidase | Neutral endopeptidase 24.11
Type:
Enzyme
Mol. Mass.:
85505.38
Organism:
Homo sapiens (Human)
Description:
P08473
Residue:
750
  
Inhibitor
Name:
BDBM50190779
Synonyms:
2-((1-(5-(1-benzyl-6-oxo-1,6-dihydropyridin-3-yl)-1,3,4-oxadiazol-2-yl)cyclopentyl)methyl)pentanoic acid | CHEMBL212374
Type:
Small organic molecule
Emp. Form.:
C25H29N3O4
Mol. Mass.:
435.5155
SMILES:
CCCC(CC1(CCCC1)c1nnc(o1)-c1ccc(=O)n(Cc2ccccc2)c1)C(O)=O
: