Target
Neprilysin
Ligand
BDBM50190782
Substrate
Meas. Tech.
ChEMBL_369150 (CHEMBL862877)
IC50
213±n/a nM
Citation
 Pryde, DCMaw, GNPlanken, SPlatts, MYSanderson, VCorless, MStobie, ABarber, CGRussell, RFoster, LBarker, LWayman, CVan Der Graaf, PStacey, PMorren, DKohl, CBeaumont, KCoggon, STute, M Novel selective inhibitors of neutral endopeptidase for the treatment of female sexual arousal disorder. Synthesis and activity of functionalized glutaramides. J Med Chem 49:4409-24 (2006)  
Target
Name:
Neprilysin
Synonyms:
Atriopeptidase CD_antigen=CD10 EPN MME NEP_HUMAN Neutral endopeptidase | Neutral endopeptidase 24.11
Type:
Enzyme
Mol. Mass.:
85505.38
Organism:
Homo sapiens (Human)
Description:
P08473
Residue:
750
  
Inhibitor
Name:
BDBM50190782
Synonyms:
2-((1-(((1R,3S)-3-carbamoylcyclopentyl)carbamoyl)cyclopentyl)methyl)pentanoic acid | CHEMBL213861
Type:
Small organic molecule
Emp. Form.:
C18H30N2O4
Mol. Mass.:
338.4418
SMILES:
CCCC(CC1(CCCC1)C(=O)N[C@@H]1CC[C@@H](C1)C(N)=O)C(O)=O
: